{"text_format":"1","workbook":"xlsx","n_sheets":4,"sheets":["Baseline Instructions","Performance Instructions","VBP Worksheet","Calculations"],"not_rendered":{"charts":0,"images":3,"macros":1,"external_links":0,"defined_names":4,"comments":0,"pivot_tables":0},"unopened":[],"bounds":{"document_bytes":16777216,"sheet_cells":100000,"rows_first":2000,"rows_last":500,"rows_between":2000,"halvings":0,"cell_chars":16384,"cell_head_chars":4096},"cells_cut":0,"cells_raw":0,"read":"whole","date_system":"1900"}

{"sheet":"Baseline Instructions","index":0,"n_rows":27,"n_cols":2,"rows_kept":27,"cut":false,"hidden":false,"merged":[[13,0,14,0],[18,0,20,0],[21,0,23,0],[26,0,26,1],[11,0,12,0],[15,0,17,0],[9,0,10,0],[0,0,0,1],[1,0,1,1],[2,0,2,1],[3,0,4,1]]}
[]
["VBP FY2018 Worksheet"]
["Baseline Data Instructions"]
["Disclaimer: This worksheet can be used to estimate your hospital's performance in the FY 2018 Hospital Value-Based Purchasing program. However, actual performance will be calculated by CMS. In particular, the performance for MSPB cannot be calculated until the performance period is over and the benchmark and threshold are calculated by CMS. "]
[]
[null,"Baseline Data Instructions"]
["To Edit Report","Click on the \"VBP Worksheet\" tab. Enter in your hospital's data in the light green cells."]
["Name of your hospital","Enter the name of your hospital in this cell."]
["Data Pulled From FY 2018 Hospital Value-Based Purchasing - Baseline Measures Report","In order to enter your hospital's baseline data in the worksheet, you will need to access your hospital's Hospital Value-Based Purchasing - Baseline Measures Report through My QualityNet.\nDirections for accessing these reports can be found in the QualityNet Reports User Guide found on the Help tab on My QualityNet."]
["Clinical Care Measures","Your Baseline ≥ 25: Enter \"Y\" if the \"Number of Eligible Discharges\" from the Baseline Measures Report is greater than or equal to 25. Enter \"N\" if less than 25. Do this for each measure separately.\nThe baseline time period is Oct 2009 - June 2012.    "]
[null,"Survival Rate %: From the \"Baseline Period Rate\" column on the Baseline Measures Report, enter the rate for each measure as it appears.. For example, if your rate is 0.847472, enter 0.847472 or .847472. Do not change the number to a percentage for entry into the worksheet. If \"-\", enter \"N/A\" or leave blank.\nNote: The Mort Rate % will be calculated automatically."]
["Patient Experience of Care (HCAHPS)","Baseline # of Surveys ≥ 100: Enter \"Y\" if the \"HCAHPS Surveys Completed During the Baseline Period\" from the Baseline Measures Report is greater than or equal to 100. Enter \"N\" if less than 100.\nThe baseline time period is Jan 2014 - Dec 2014.    "]
[null,"%: From the \"Baseline Period Rate\" column on the Baseline Measures Report, enter the rate for each measure. Do not enter the actual % sign.\nDo not enter anything for Q8 and Q9.\nFor the Average of Q8 & Q9, enter the Cleanliness and Quietness of Hospital Environment rate."]
["Safety Measures: AHRQ Composite Measures","Your Baseline # of cases on any underlying indicator ≥ 3: Because there is no way to tell this from this report, keep this as \"Y\".\nThe baseline time period is Jul 1, 2010 - June 30 2012. "]
[null,"Ratio: From the \"Index Value\" column on the Baseline Measures Report, enter the rate for the measure. "]
["Safety Measures: Healthcare Associated Infections","Your Baseline: The baseline time period is Jan 2014 - Dec 2014. "]
[null,"# predicted infections: From the \"Number of Predicted Infections (Denominator)\" column on the Baseline Measures Report, enter the number of predicted infections for each measure. If \"N/A\", enter \"N/A\" or leave blank."]
[null,"SIR: From the \"Standardized Infection Ratio (SIR)\" column on the Baseline Measures Report, enter the ratio for each measure.  \nIf \"-\" or N/A, enter \"N/A\" or leave blank."]
["Safety Measures: Process Measures","Your Baseline: ≥ 10: Enter \"Y\" if the \"Number of Eligible Discharges\" from the Baseline Measures Report is greater than or equal to 10. Enter \"N\" if less than 10. Do this for each measure separately. \nThe baseline time period is Jan 2014 - Dec 2014. "]
[null,"# of cases: From the \"Denominator\" column on the Baseline Measures Report, enter the number of patients for each measure. If denominator is N/A, enter \"0\" or leave blank."]
{"$rows_left_out":8}
{"sheet":"Performance Instructions","index":1,"n_rows":33,"n_cols":2,"rows_kept":33,"cut":false,"hidden":false,"merged":[[12,0,13,0],[17,0,19,0],[20,0,24,0],[32,0,32,1],[10,0,11,0],[14,0,16,0],[8,0,9,0],[0,0,0,1],[1,0,1,1],[2,0,2,1],[3,0,4,1]]}
[]
["VBP FY2018 Worksheet"]
["Performance Period Instructions"]
["Disclaimer: This worksheet can be used to estimate your hospital's performance in the FY 2018 Hospital Value-Based Purchasing program. However, actual performance will be calculated by CMS. In particular, the performance for MSPB cannot be calculated until the performance period is over and the benchmark and threshold are calculated by CMS. "]
[]
[null,"Performance Period Instructions"]
["To Edit Report","Click on the \"VBP Worksheet\" tab. Enter in  your hospital's data in the light green cells."]
["Data Pulled From Inpatient Hospital Compare Preview Report and Medicare Spending Per Beneficiary Report","In order to enter your hospital's performance period data in the worksheet, you will need to access your hospital's Preview Report and Medicare Spending Per Beneficiary Report through My QualityNet.\nDirections for accessing these reports can be found in the QualityNet Reports User Guide found on the Help tab on My QualityNet. "]
["Clinical Care Measures","Your Performance ≥ 25: Enter \"Y\" if the \"Your Hospital's Number of Eligible Medicare Admissions\" from the Preview Report is greater than or equal to 25. Enter \"N\" if less than 25. Do this for each measure separately.\nThe performance time period is Oct 2013 - June 2016. This worksheet can be used to monitor progress prior to the performance period. If you use data prior to the performance period, then modify this date by entering in the date found in the header of the Preview Report.   "]
[null,"Mort Rate %: From the \"Your Hospital's Risk-Standardized Mortality Rate\" columns on the Preview Report, enter the percentage rate for each measure, excluding the % sign. The rate is the number to the left of the parenthesis, not inside the parenthesis. If N/A, enter \"N/A\" or leave blank.\nNote: The Survival Rate % will be calculated automatically."]
["Patient Experience of Care (HCAHPS)","Performance # of Surveys ≥ 100: Enter \"Y\" if the \"Number of Completed Surveys\" from the Preview Report is greater than or equal to 100. Enter \"N\" if less than 100.\nThe performance time period is Jan 2016 - Dec 2016. This worksheet can be used to monitor progress prior to the performance period. If you use data prior to the performance period, then modify this date by entering in the date found in the header of the Preview Report.   "]
[null,"%: From the \"Your Hospital's Adjusted Score\" columns on the Preview Report, enter the % for each measure.\nComposites 1 through 5, Q8, and Q9, enter the % Always.\nComposite 6, enter the % Yes.\nQ21, enter the % 9 and 10 rating.\nNote: The Average of Q8 & Q9 will be calculated automatically. "]
["Safety Measures: AHRQ Composite Measures","Your Performance # of cases on any underlying indicator ≥ 3: Enter \"Y\" if the \"Your Hospital's Number of Eligible Medicare Discharges\" for ANY of the underlying indicators from the Preview Report is less than or equal to 3. Enter \"N\" if ALL are less than 3. Note: All hospitals will have N/A for \"Your Hospital's Number of Eligible Medicare Discharges\" for PSI-90 so you must look at the underlying indicators, which are: PSI-03, PSI-06, PSI-07, PSI-08, PSI-12, PSI-13, PSI-14, and PSI-15.\nThe performance time period is Jul 1, 2014 - June 30, 2016. This worksheet can be used to monitor progress prior to the performance period. If you use data prior to the performance period, then modify this date by entering in the date found in the header of the Preview Report."]
[null,"Ratio: From the \"Your Hospital's PSI Rate\" column on the Preview Report, enter the rate for the measure. The rate is the number to the left of the parenthesis, not inside the parenthesis. "]
["Safety Measures: Healthcare Associated Infections","Your Performance: The performance time period is Jan 2016 - Dec 2016. This worksheet can be used to monitor progress prior to the performance period. If you use data prior to the performance period, then modify this date by entering in the date found in the header of the Preview Report."]
[null,"# predicted infections: From the \"Your Hospital's Predicted Number of Infections\" column on the Preview Report, enter the number of predicted infections for each measure. If N/A, enter \"N/A\" or leave blank."]
[null,"SIR: From the \"Ratio of Reported to Predicted Infections (SIR)\" column on the Preview Report, enter the ratio for each measure. The ratio is the number to the left of the parenthesis, not inside the parenthesis. \nNote: SIR stands for Standardized Infection Ratio. If N/A, enter \"N/A\" or leave blank."]
["Safety Measures: Process Measures","Your Performance: ≥ 10: Enter \"Y\" if the \"Number of Eligible Discharges\" from the Baseline Measures Report is greater than or equal to 10. Enter \"N\" if less than 10. Do this for each measure separately. \nThe performance time period is Jan 2016 - Dec 2016. This worksheet can be used to monitor progress prior to the performance period. If you use data prior to the performance period, then modify this date by entering in the date found in the header of the Preview Report."]
[null,"# of cases: From the \"Your Hospital Performance Aggregate Rate for All Four Quarters\" column on the Preview Report, enter the number of patients for each measure. If rate is N/A (number of patients is missing), enter \"0\" or leave blank."]
[null,"%: From the \"Your Hospital Performance Aggregate Rate for All Four Quarters\" column on the Preview Report, enter the rate for each measure, excluding the % sign. If N/A, enter \"N/A\" or leave blank. Note: Since the preview reports do not give numerators and do not have any decimal points for the rates, the actual dimension points are only estimates."]
{"$rows_left_out":14}
{"sheet":"VBP Worksheet","index":2,"n_rows":69,"n_cols":23,"rows_kept":69,"cut":false,"hidden":false,"merged":[[36,14,38,14],[36,15,38,15],[36,16,38,16],[40,14,41,14],[40,15,41,15],[40,16,41,16],[47,2,47,3],[47,4,47,5],[47,6,47,7],[47,8,47,9],[47,14,47,16],[45,8,45,9],[45,14,45,16],[53,2,53,5],[53,6,53,9],[54,2,54,3],[54,4,54,5],[59,0,61,1],[57,0,57,1],[59,16,61,16],[58,13,58,16],[59,10,60,13],[59,14,61,14],[59,15,61,15],[61,10,61,11],[61,12,61,13],[54,6,54,7],[54,8,54,9],[54,14,54,16],[61,6,61,7],[61,8,61,9],[58,0,58,11],[57,6,57,16],[48,2,48,3],[48,4,48,5],[48,6,48,7],[48,8,48,9],[37,12,37,13],[37,2,38,3],[37,6,38,7],[37,0,38,1],[35,2,35,5],[35,6,35,9],[41,8,41,9],[37,4,37,5],[37,8,37,9],[38,8,38,9],[44,4,44,5],[44,6,44,7],[44,8,44,9],[46,2,46,3],[46,4,46,5],[46,6,46,7],[46,8,46,9],[4,0,6,1],[28,2,28,4],[9,0,9,1],[7,0,7,1],[26,2,26,4],[26,5,26,6],[20,2,20,4],[20,5,20,6],[21,2,21,4],[21,5,21,6],[22,2,22,4],[22,5,22,6],[17,5,17,6],[18,3,18,4],[28,5,28,6],[9,2,9,3],[9,4,9,5],[9,6,9,7],[17,2,17,4],[17,0,17,1],[11,14,11,16],[49,0,49,1],[49,2,49,3],[49,4,49,5],[49,6,49,7],[49,8,49,9],[49,14,49,16],[43,0,43,1],[43,2,43,3],[43,4,43,5],[43,6,43,7],[43,8,43,9],[39,2,39,3],[39,4,39,5],[39,6,39,7],[39,8,39,9],[43,14,43,16],[44,2,44,3],[34,12,34,16],[29,2,29,4],[29,5,29,6],[36,0,36,1],[36,6,36,9],[38,4,38,5],[4,10,5,13],[6,10,6,11],[62,2,62,3],[62,4,62,5],[62,6,62,7],[62,8,62,9],[6,2,6,3],[6,4,6,5],[6,6,6,7],[6,8,6,9],[59,2,59,5],[59,6,59,9],[60,2,60,5],[60,6,60,9],[61,2,61,3],[61,4,61,5],[55,6,55,7],[55,8,55,9],[51,4,51,5],[51,6,51,7],[7,6,7,7],[7,8,7,9],[50,2,50,3],[36,2,36,5],[68,0,68,16],[65,0,65,1],[65,6,65,16],[66,0,66,11],[66,13,66,16],[67,0,67,7],[63,2,63,3],[63,4,63,5],[63,6,63,7],[63,8,63,9],[64,0,64,1],[64,6,64,16],[67,8,67,16],[9,8,9,9],[10,2,10,3],[10,4,10,5],[10,6,10,7],[41,2,41,3],[34,0,34,11],[40,0,40,1],[32,0,32,2],[18,7,19,9],[30,2,30,4],[30,5,30,6],[31,0,31,2],[33,0,33,2],[35,0,35,1],[37,10,37,11],[14,0,14,1],[14,6,14,16],[15,0,15,11],[15,13,15,16],[16,2,16,6],[16,7,17,13],[16,14,19,14],[16,15,19,15],[16,16,19,16],[52,2,52,5],[52,6,52,9],[56,0,56,1],[40,2,40,5],[40,6,40,9],[53,0,53,1],[56,6,56,16],[50,4,50,5],[50,6,50,7],[50,8,50,9],[51,2,51,3],[55,2,55,3],[55,4,55,5],[45,0,45,1],[45,2,45,3],[45,4,45,5],[45,6,45,7],[51,8,51,9],[42,2,42,3],[42,4,42,5],[42,6,42,7],[42,8,42,9],[41,4,41,5],[41,6,41,7],[6,12,6,13],[5,2,5,5],[5,6,5,9],[26,14,26,16],[27,2,27,4],[27,5,27,6],[23,2,23,4],[23,5,23,6],[24,2,24,4],[24,5,24,6],[25,2,25,4],[25,5,25,6],[25,14,25,16],[18,10,19,11],[18,12,19,13],[19,2,19,4],[19,5,19,6],[4,14,7,14],[4,15,7,15],[4,16,7,16],[9,14,9,16],[8,8,8,9],[7,2,7,3],[7,4,7,5],[3,14,3,16],[0,0,0,9],[1,1,2,5],[3,0,3,1],[3,2,3,5],[3,6,3,9],[3,11,3,13],[13,0,13,1],[13,6,13,16],[11,2,11,3],[11,4,11,5],[11,6,11,7],[11,8,11,9],[11,0,11,1],[12,2,12,3],[12,4,12,5],[12,6,12,7],[12,8,12,9],[10,8,10,9],[8,2,8,3],[8,4,8,5],[8,6,8,7],[4,2,4,5],[4,6,4,9]]}
[]
[null,"VBP FY2018 Worksheet "]
[]
["Name of your hospital",null,"Input",null,null,null,"Input",null,null,null,null,null,null,null,"Output"]
["Clinical Care",null,"Your Baseline",null,null,null,"Your Performance",null,null,null,"Outcome Measures Performance Standard",null,null,null,"Achievement","Improvement","Points"]
[null,null,"Oct 2009 - Jun 2012",null,null,null,"Oct 2013 -  Jun 2016"]
[null,null,"Mort Rate     %",null,"Survival Rate %",null,"Mort Rate     %",null,"Survival Rate %",null,"Benchmark",null,"Threshold"]
["30-day Mortality, AMI",null,"≥ 25",null,"Y",null,"≥ 25",null,"Y"]
[null,"MORT-30-AMI",{"$f":"IF(ISNUMBER(E9),1-E9,\"\")","v":""},null,null,null,null,null,{"$f":"IF(ISNUMBER(G9),100-G9,\"\")","v":""},null,null,87.305300000000003,null,85.0916,{"$f":"IF(OR(UPPER(I8)=\"N\",I8=\"\",I9=\"\"),\"\",ROUND(Ascore((100*E9),I9,L9,N9),0))","v":""},{"$f":"IF(OR(UPPER(E8)=\"N\", UPPER(I8)=\"N\",I8=\"\",E8=\"\",E9=\"\",I9=\"\"),\"\",MIN(9,ROUND(imt((100*E9),I9,L9,N9),0)))","v":""},{"$f":"IF(OR(ISNUMBER(O9),ISNUMBER(P9)),MAX(O9:P9),\"\")","v":""}]
["30-day Mortality, Heart Failure",null,"≥ 25",null,"Y",null,"≥ 25",null,"Y"]
[null,"MORT-30-HF",{"$f":"IF(ISNUMBER(E11),1-E11,\"\")","v":""},null,null,null,null,null,{"$f":"IF(ISNUMBER(G11),100-G11,\"\")","v":""},null,null,90.765600000000006,null,88.342100000000002,{"$f":"IF(OR(UPPER(I10)=\"N\",I10=\"\",I11=\"\"),\"\",ROUND(Ascore((100*E11),I11,L11,N11),0))","v":""},{"$f":"IF(OR(UPPER(E10)=\"N\", UPPER(I10)=\"N\",I10=\"\",E10=\"\",E11=\"\",I11=\"\"),\"\",MIN(9,ROUND(imt((100*E11),I11,L11,N11),0)))","v":""},{"$f":"IF(OR(ISNUMBER(O11),ISNUMBER(P11)),MAX(O11:P11),\"\")","v":""}]
["30-day Mortality, Pneumonia",null,"≥ 25",null,"Y",null,"≥ 25",null,"Y"]
[null,"MORT-30-PN",{"$f":"IF(ISNUMBER(E13),1-E13,\"\")","v":""},null,null,null,null,null,{"$f":"IF(ISNUMBER(G13),100-G13,\"\")","v":""},null,null,90.79,null,88.286000000000001,{"$f":"IF(OR(UPPER(I12)=\"N\",I12=\"\",I13=\"\"),\"\",ROUND(Ascore((100*E13),I13,L13,N13),0))","v":""},{"$f":"IF(OR(UPPER(E12)=\"N\", UPPER(I12)=\"N\",I12=\"\",E12=\"\",E13=\"\",I13=\"\"),\"\",MIN(9,ROUND(imt((100*E13),I13,L13,N13),0)))","v":""},{"$f":"IF(OR(ISNUMBER(O13),ISNUMBER(P13)),MAX(O13:P13),\"\")","v":""}]
["Your VBP Clinical Care Earned Points",null,null,null,null,null,{"$f":"IF(COUNT(Q9:Q9,Q11:Q11,Q13:Q13)>=2, SUM(Q9:Q9,Q11:Q11,Q13:Q13),\"     Need at least 2 clinical care measures with # of cases ≥ 25\")","v":"     Need at least 2 clinical care measures with # of cases ≥ 25"}]
["Your VBP Clinical Care Potential Points",null,null,null,null,null,{"$f":"IF(COUNT(Q9:Q9,Q11:Q11,Q13:Q13)>=2,COUNT(Q9:Q9,Q11:Q11,Q13:Q13)*10,\"     Need at least 2 clinical care measures with # of cases ≥ 25\")","v":"     Need at least 2 clinical care measures with # of cases ≥ 25"}]
["Your VBP Clinical Care Domain Score =(100*Your Earned Points/Your Potential Earned Points)",null,null,null,null,null,null,null,null,null,null,null,null,{"$f":"IF(G15<>\"     Need at least 2 clinical care measures with # of cases ≥ 25\",\"(\"&G14&\" / \"&G15&\")*100 = \"&TEXT(((G14/(G15))*100),\"00.00\")&\"\",\"Need Clinical Care data\")","v":"Need Clinical Care data"}]
[null,null,"Your HCAHPS Survey",null,null,null,null,"HCAHPS Performance Standard",null,null,null,null,null,null,"Achievement","Improvement","Points"]
["Patient Experience of Care",null,"Baseline             # of  Surveys",null,null,"Performance      # of  Surveys"]
[null,null,"≥100","Y",null,"≥100","Y","Floor            (Minimum)",null,null,"Benchmark",null,"Threshold"]
["HCAHPS Survey Dimensions",null,"Jan 2014 -       Dec 2014",null,null,"Jan 2016 -       Dec 2016"]
{"$rows_left_out":50}
{"sheet":"Calculations","index":3,"n_rows":71,"n_cols":16,"rows_kept":71,"cut":false,"hidden":true,"merged":[]}
["Domain",null,"Present",null,"Score","Factor",null,"Clinical Care Process","Clinical Care Outcomes","Experience","Safety","Efficiency"]
[]
["Clinical Care Process",null,{"$f":"IF('VBP Worksheet'!G15=\"     Need at least 2 clinical care measures with # of cases ≥ 25\",\"N\",\"Y\")","v":"N"},null,"SUM(Q9,Q11,Q13)/(COUNT(Q9,Q11,Q13)*10)*100",0.25,{"$f":"(1-F3)","v":0.75}]
["Experience",null,{"$f":"IF('VBP Worksheet'!M35=\"Need HCAHPS data\",\"N\",\"Y\")","v":"N"},null,"SUM(Q21,Q22,Q23,Q24,Q25,Q28,Q29,Q30,Q31)/(COUNT(Q21,Q22,Q23,Q24,Q25,Q28,Q29,Q30,Q31)*10))*100",0.25,{"$f":"(1-F4)","v":0.75}]
["Safety",null,{"$f":"IF('VBP Worksheet'!G58=\"     Need at least 3 safety measures\",\"N\",\"Y\")","v":"N"},null,"SUM(Q39,Q42,Q45,Q47,Q51,Q53,Q55)/(COUNT(Q39,Q42,Q45,Q47,Q51,Q53,Q55)*10))*100",0.25,0.75]
["Efficiency",null,{"$f":"IF('VBP Worksheet'!G66=\"     Need Efficiency data\",\"N\",\"Y\")","v":"N"},null,"SUM(Q63)/(COUNT(Q63)*10))*100",0.25,0.75]
[]
[]
[null,null,null,null,null,{"$f":"SUM(F3:F6)","v":1}]
[null,"# Domains"]
["None Missing",4,null,null,null,{"$f":"(('VBP Worksheet'!G14/('VBP Worksheet'!G15))*100*0.25)+ (('VBP Worksheet'!Q33+'VBP Worksheet'!Q34)*0.25)+ (('VBP Worksheet'!G57/('VBP Worksheet'!G58))*100*0.25)+ (('VBP Worksheet'!G65/('VBP Worksheet'!G66))*100*0.25)","v":{"$error":"#VALUE!"}},"TEXT((((SUM('VBP Worksheet'!Q9,'VBP Worksheet'!Q11,'VBP Worksheet'!Q13)/(COUNT('VBP Worksheet'!Q9,'VBP Worksheet'!Q11,'VBP Worksheet'!Q13)*10))*100)*0.25)+(((SUM('VBP Worksheet'!Q21,'VBP Worksheet'!Q22,'VBP Worksheet'!Q23,'VBP Worksheet'!Q24,'VBP Worksheet'!Q25,'VBP Worksheet'!Q28, 'VBP Worksheet'!Q29,'VBP Worksheet'!Q30, 'VBP Worksheet'!Q31)/(COUNT('VBP Worksheet'!Q21,'VBP Worksheet'!Q22,'VBP Worksheet'!Q23,'VBP Worksheet'!Q24,'VBP Worksheet'!Q25,'VBP Worksheet'!Q28,'VBP Worksheet'!Q29,'VBP Worksheet'!Q30,'VBP Worksheet'!Q31)*10))*100)*0.25)+(((SUM('VBP Worksheet'!Q39,'VBP Worksheet'!Q42,'VBP Worksheet'!Q45,'VBP Worksheet'!Q47,'VBP Worksheet'!Q51,'VBP Worksheet'!Q53, 'VBP Worksheet'!Q55)/(COUNT('VBP Worksheet'!Q39,'VBP Worksheet'!Q42,'VBP Worksheet'!Q45,'VBP Worksheet'!Q47,'VBP Worksheet'!Q51,'VBP Worksheet'!Q53,'VBP Worksheet'!Q55)*10))*100)*0.25)+(((SUM('VBP Worksheet'!Q63)/(COUNT('VBP Worksheet'!Q63)*10))*100)*0.25),\"00.00\")&\"\"",null,null,null,null,null,null,null,null,{"$f":"COUNT(Q5,Q7,Q9)","v":0}]
[]
[]
["Clinical Care Missing",3,null,null,null,{"$f":" (('VBP Worksheet'!Q33+'VBP Worksheet'!Q34)*0.33333333)+ (('VBP Worksheet'!G57/('VBP Worksheet'!G58))*100*0.33333333)+ (('VBP Worksheet'!G65/('VBP Worksheet'!G66))*100*0.33333333)","v":{"$error":"#VALUE!"}},"TEXT((((SUM('VBP Worksheet'!Q21,'VBP Worksheet'!Q22,'VBP Worksheet'!Q23,'VBP Worksheet'!Q24,'VBP Worksheet'!Q25,'VBP Worksheet'!Q28, 'VBP Worksheet'!Q29,'VBP Worksheet'!Q30, 'VBP Worksheet'!Q31)/(COUNT('VBP Worksheet'!Q21,'VBP Worksheet'!Q22,'VBP Worksheet'!Q23,'VBP Worksheet'!Q24,'VBP Worksheet'!Q25,'VBP Worksheet'!Q28,'VBP Worksheet'!Q29,'VBP Worksheet'!Q30,'VBP Worksheet'!Q31)*10))*100)*0.333333)+(((SUM('VBP Worksheet'!Q39,'VBP Worksheet'!Q42,'VBP Worksheet'!Q45,'VBP Worksheet'!Q47,'VBP Worksheet'!Q51,'VBP Worksheet'!Q53, 'VBP Worksheet'!Q55)/(COUNT('VBP Worksheet'!Q39,'VBP Worksheet'!Q42,'VBP Worksheet'!Q45,'VBP Worksheet'!Q47,'VBP Worksheet'!Q51,'VBP Worksheet'!Q53,'VBP Worksheet'!Q55)*10))*100)*0.333333)+(((SUM('VBP Worksheet'!Q63)/(COUNT('VBP Worksheet'!Q63)*10))*100)*0.333333),\"00.00\")&\"\"",6.6666669999999997E-2,0,0.33333332999999998,0.26666666,0.33333332999999998,null,{"$f":"SUM(H14:L14)","v":0.99999998999999995}]
["Experience Missing",3,null,null,null,{"$f":"(('VBP Worksheet'!G14/('VBP Worksheet'!G15))*100*0.33333333)+ (('VBP Worksheet'!G57/('VBP Worksheet'!G58))*100*0.33333333)+ (('VBP Worksheet'!G65/('VBP Worksheet'!G66))*100*0.33333333)","v":{"$error":"#VALUE!"}},"TEXT((((SUM('VBP Worksheet'!Q9,'VBP Worksheet'!Q11,'VBP Worksheet'!Q13)/(COUNT('VBP Worksheet'!Q9,'VBP Worksheet'!Q11,'VBP Worksheet'!Q13)*10))*100)*0.333333)+(((SUM('VBP Worksheet'!Q39,'VBP Worksheet'!Q42,'VBP Worksheet'!Q45,'VBP Worksheet'!Q47,'VBP Worksheet'!Q51,'VBP Worksheet'!Q53, 'VBP Worksheet'!Q55)/(COUNT('VBP Worksheet'!Q39,'VBP Worksheet'!Q42,'VBP Worksheet'!Q45,'VBP Worksheet'!Q47,'VBP Worksheet'!Q51,'VBP Worksheet'!Q53,'VBP Worksheet'!Q55)*10))*100)*0.333333)+(((SUM('VBP Worksheet'!Q63)/(COUNT('VBP Worksheet'!Q63)*10))*100)*0.333333),\"00.00\")&\"\"",6.6666669999999997E-2,0.33333332999999998,0,0.26666666,0.33333332999999998,null,0.99999998999999995]
["Safety Missing",3,null,null,null,{"$f":"(('VBP Worksheet'!G14/('VBP Worksheet'!G15))*100*0.33333333)+ (('VBP Worksheet'!Q33+'VBP Worksheet'!Q34)* 0.33333333)+ (('VBP Worksheet'!G65/('VBP Worksheet'!G66))*100*0.33333333)","v":{"$error":"#VALUE!"}},"TEXT((((SUM('VBP Worksheet'!Q9,'VBP Worksheet'!Q11,'VBP Worksheet'!Q13)/(COUNT('VBP Worksheet'!Q9,'VBP Worksheet'!Q11,'VBP Worksheet'!Q13)*10))*100)*0.333333)+(((SUM('VBP Worksheet'!Q21,'VBP Worksheet'!Q22,'VBP Worksheet'!Q23,'VBP Worksheet'!Q24,'VBP Worksheet'!Q25,'VBP Worksheet'!Q28, 'VBP Worksheet'!Q29,'VBP Worksheet'!Q30,'VBP Worksheet'!Q31)/(COUNT('VBP Worksheet'!Q21,'VBP Worksheet'!Q22,'VBP Worksheet'!Q23,'VBP Worksheet'!Q24,'VBP Worksheet'!Q25,'VBP Worksheet'!Q28,'VBP Worksheet'!Q29,'VBP Worksheet'!Q30,'VBP Worksheet'!Q31)*10))*100)*0.333333)+(((SUM('VBP Worksheet'!Q63)/(COUNT('VBP Worksheet'!Q63)*10))*100)*0.333333),\"00.00\")&\"\"",6.25E-2,0.3125,0.3125,0,0.3125,null,1]
["Efficiency Missing",3,null,null,null,{"$f":"(('VBP Worksheet'!G14/('VBP Worksheet'!G15))*100*0.33333333)+ (('VBP Worksheet'!Q33+'VBP Worksheet'!Q34)* 0.33333333)+ (('VBP Worksheet'!G57/('VBP Worksheet'!G58))*100*0.33333333)","v":{"$error":"#VALUE!"}},"TEXT((((SUM('VBP Worksheet'!Q9,'VBP Worksheet'!Q11,'VBP Worksheet'!Q13)/(COUNT('VBP Worksheet'!Q9,'VBP Worksheet'!Q11,'VBP Worksheet'!Q13)*10))*100)*0.333333)+(((SUM('VBP Worksheet'!Q21,'VBP Worksheet'!Q22,'VBP Worksheet'!Q23,'VBP Worksheet'!Q24,'VBP Worksheet'!Q25,'VBP Worksheet'!Q28, 'VBP Worksheet'!Q29,'VBP Worksheet'!Q30,'VBP Worksheet'!Q31)/(COUNT('VBP Worksheet'!Q21,'VBP Worksheet'!Q22,'VBP Worksheet'!Q23,'VBP Worksheet'!Q24,'VBP Worksheet'!Q25,'VBP Worksheet'!Q28,'VBP Worksheet'!Q29,'VBP Worksheet'!Q30,'VBP Worksheet'!Q31)*10))*100)*0.333333)+(((SUM('VBP Worksheet'!Q39,'VBP Worksheet'!Q42,'VBP Worksheet'!Q45,'VBP Worksheet'!Q47,'VBP Worksheet'!Q51,'VBP Worksheet'!Q53, 'VBP Worksheet'!Q55)/(COUNT('VBP Worksheet'!Q39,'VBP Worksheet'!Q42,'VBP Worksheet'!Q45,'VBP Worksheet'!Q47,'VBP Worksheet'!Q51,'VBP Worksheet'!Q53,'VBP Worksheet'!Q55)*10))*100)*0.333333),\"00.00\")&\"\"",6.6666669999999997E-2,0.33333332999999998,0.33333332999999998,0.26666666,0,null,0.99999999000000006]
[]
["Clinical Care and Experience Missing",2]
["Clinical Care and Safety Missing",2]
{"$rows_left_out":51}